index.html

Report generated on 27-Jun-2020 at 14:02:41 by pytest-html v2.1.1

Environment

CI true
JAVA_HOME /usr/lib/jvm/zulu-8-azure-amd64
Packages {"pluggy": "0.13.1", "py": "1.8.1", "pytest": "5.4.3"}
Platform Linux-5.3.0-1028-azure-x86_64-with-glibc2.2.5
Plugins {"aresponses": "1.1.2", "asyncio": "0.10.0", "cov": "2.10.0", "html": "2.1.1", "metadata": "1.9.0", "mock": "2.0.0", "mypy": "0.4.2"}
Python 3.8.3

Summary

590 tests ran in 9.98 seconds.

590 passed, 0 skipped, 0 failed, 0 errors, 0 expected failures, 0 unexpected passes

Results

Result Test Duration Links
Passed tests/test_api/test_client/test_api_server.py::TestAPIServer::test_method_url 0.00
No log output captured.
Passed tests/test_api/test_client/test_api_server.py::TestAPIServer::test_file_url 0.00
No log output captured.
Passed tests/test_api/test_client/test_bot.py::TestBot::test_init 0.00
No log output captured.
Passed tests/test_api/test_client/test_bot.py::TestBot::test_hashable 0.00
No log output captured.
Passed tests/test_api/test_client/test_bot.py::TestBot::test_equals 0.00
No log output captured.
Passed tests/test_api/test_client/test_bot.py::TestBot::test_emit 0.01
No log output captured.
Passed tests/test_api/test_client/test_bot.py::TestBot::test_close 0.00
-------------------------------Captured log call--------------------------------
ERROR asyncio:client.py:314 Unclosed client session client_session: <aiohttp.client.ClientSession object at 0x7f242de9c670>
Passed tests/test_api/test_client/test_bot.py::TestBot::test_context_manager[True] 0.00
No log output captured.
Passed tests/test_api/test_client/test_bot.py::TestBot::test_context_manager[False] 0.00
No log output captured.
Passed tests/test_api/test_client/test_bot.py::TestBot::test_download_file 0.01
-------------------------------Captured log call--------------------------------
ERROR asyncio:client.py:314 Unclosed client session client_session: <aiohttp.client.ClientSession object at 0x7f242dde6be0> ERROR asyncio:connector.py:282 Unclosed connector connections: ['[(<aiohttp.client_proto.ResponseHandler object at 0x7f242def99a0>, 187.189)]'] connector: <aiohttp.connector.TCPConnector object at 0x7f242dde6820>
Passed tests/test_api/test_client/test_bot.py::TestBot::test_download_file_default_destination 0.00
-------------------------------Captured log call--------------------------------
ERROR asyncio:client.py:314 Unclosed client session client_session: <aiohttp.client.ClientSession object at 0x7f242de10370> ERROR asyncio:connector.py:282 Unclosed connector connections: ['[(<aiohttp.client_proto.ResponseHandler object at 0x7f242d5b13a0>, 187.199)]'] connector: <aiohttp.connector.TCPConnector object at 0x7f242dde6460>
Passed tests/test_api/test_client/test_bot.py::TestBot::test_download_file_custom_destination 0.00
-------------------------------Captured log call--------------------------------
ERROR asyncio:client.py:314 Unclosed client session client_session: <aiohttp.client.ClientSession object at 0x7f242de13ca0> ERROR asyncio:connector.py:282 Unclosed connector connections: ['[(<aiohttp.client_proto.ResponseHandler object at 0x7f242d5b15e0>, 187.208)]'] connector: <aiohttp.connector.TCPConnector object at 0x7f242de13af0>
Passed tests/test_api/test_client/test_bot.py::TestBot::test_download 0.01
No log output captured.
Passed tests/test_api/test_client/test_session/test_aiohttp_session.py::TestAiohttpSession::test_create_session 0.00
-------------------------------Captured log call--------------------------------
ERROR asyncio:client.py:314 Unclosed client session client_session: <aiohttp.client.ClientSession object at 0x7f242d5d0400>
Passed tests/test_api/test_client/test_session/test_aiohttp_session.py::TestAiohttpSession::test_create_proxy_session 0.00
-------------------------------Captured log call--------------------------------
ERROR asyncio:client.py:314 Unclosed client session client_session: <aiohttp.client.ClientSession object at 0x7f242d5d0b50>
Passed tests/test_api/test_client/test_session/test_aiohttp_session.py::TestAiohttpSession::test_create_proxy_session_proxy_url 0.00
-------------------------------Captured log call--------------------------------
ERROR asyncio:client.py:314 Unclosed client session client_session: <aiohttp.client.ClientSession object at 0x7f242d5d53a0>
Passed tests/test_api/test_client/test_session/test_aiohttp_session.py::TestAiohttpSession::test_create_proxy_session_chained_proxies 0.00
-------------------------------Captured log call--------------------------------
ERROR asyncio:client.py:314 Unclosed client session client_session: <aiohttp.client.ClientSession object at 0x7f242d5d5bb0>
Passed tests/test_api/test_client/test_session/test_aiohttp_session.py::TestAiohttpSession::test_reset_connector 0.00
No log output captured.
Passed tests/test_api/test_client/test_session/test_aiohttp_session.py::TestAiohttpSession::test_close_session 0.00
-------------------------------Captured log call--------------------------------
ERROR asyncio:client.py:314 Unclosed client session client_session: <aiohttp.client.ClientSession object at 0x7f242d342ac0>
Passed tests/test_api/test_client/test_session/test_aiohttp_session.py::TestAiohttpSession::test_build_form_data_with_data_only 0.00
No log output captured.
Passed tests/test_api/test_client/test_session/test_aiohttp_session.py::TestAiohttpSession::test_build_form_data_with_files 0.00
No log output captured.
Passed tests/test_api/test_client/test_session/test_aiohttp_session.py::TestAiohttpSession::test_make_request 0.01
-------------------------------Captured log call--------------------------------
ERROR asyncio:client.py:314 Unclosed client session client_session: <aiohttp.client.ClientSession object at 0x7f242d3512b0> ERROR asyncio:connector.py:282 Unclosed connector connections: ['[(<aiohttp.client_proto.ResponseHandler object at 0x7f242d5b1be0>, 187.249)]'] connector: <aiohttp.connector.TCPConnector object at 0x7f242d3511f0>
Passed tests/test_api/test_client/test_session/test_aiohttp_session.py::TestAiohttpSession::test_stream_content 0.00
-------------------------------Captured log call--------------------------------
ERROR asyncio:client.py:314 Unclosed client session client_session: <aiohttp.client.ClientSession object at 0x7f242d365c70> ERROR asyncio:connector.py:282 Unclosed connector connections: ['[(<aiohttp.client_proto.ResponseHandler object at 0x7f242d5b1d00>, 187.26)]'] connector: <aiohttp.connector.TCPConnector object at 0x7f242d3517c0>
Passed tests/test_api/test_client/test_session/test_aiohttp_session.py::TestAiohttpSession::test_context_manager 0.01
No log output captured.
Passed tests/test_api/test_client/test_session/test_base_session.py::TestBaseSession::test_init_api 0.00
No log output captured.
Passed tests/test_api/test_client/test_session/test_base_session.py::TestBaseSession::test_default_props 0.00
No log output captured.
Passed tests/test_api/test_client/test_session/test_base_session.py::TestBaseSession::test_timeout 0.00
No log output captured.
Passed tests/test_api/test_client/test_session/test_base_session.py::TestBaseSession::test_init_custom_api 0.00
No log output captured.
Passed tests/test_api/test_client/test_session/test_base_session.py::TestBaseSession::test_prepare_value 0.00
No log output captured.
Passed tests/test_api/test_client/test_session/test_base_session.py::TestBaseSession::test_clean_json 0.00
No log output captured.
Passed tests/test_api/test_client/test_session/test_base_session.py::TestBaseSession::test_clean_json_with_nested_json 0.00
No log output captured.
Passed tests/test_api/test_client/test_session/test_base_session.py::TestBaseSession::test_clean_json_not_json 0.00
No log output captured.
Passed tests/test_api/test_client/test_session/test_base_session.py::TestBaseSession::test_raise_for_status 0.00
No log output captured.
Passed tests/test_api/test_client/test_session/test_base_session.py::TestBaseSession::test_make_request 0.00
No log output captured.
Passed tests/test_api/test_client/test_session/test_base_session.py::TestBaseSession::test_stream_content 0.00
No log output captured.
Passed tests/test_api/test_client/test_session/test_base_session.py::TestBaseSession::test_context_manager 0.00
No log output captured.
Passed tests/test_api/test_methods/test_add_sticker_to_set.py::TestAddStickerToSet::test_method 0.00
No log output captured.
Passed tests/test_api/test_methods/test_add_sticker_to_set.py::TestAddStickerToSet::test_bot_method 0.00
No log output captured.
Passed tests/test_api/test_methods/test_answer_callback_query.py::TestAnswerCallbackQuery::test_method 0.00
No log output captured.
Passed tests/test_api/test_methods/test_answer_callback_query.py::TestAnswerCallbackQuery::test_bot_method 0.00
No log output captured.
Passed tests/test_api/test_methods/test_answer_inline_query.py::TestAnswerInlineQuery::test_method 0.00
No log output captured.
Passed tests/test_api/test_methods/test_answer_inline_query.py::TestAnswerInlineQuery::test_bot_method 0.00
No log output captured.
Passed tests/test_api/test_methods/test_answer_inline_query.py::TestAnswerInlineQuery::test_parse_mode 0.00
No log output captured.
Passed tests/test_api/test_methods/test_answer_pre_checkout_query.py::TestAnswerPreCheckoutQuery::test_method 0.00
No log output captured.
Passed tests/test_api/test_methods/test_answer_pre_checkout_query.py::TestAnswerPreCheckoutQuery::test_bot_method 0.00
No log output captured.
Passed tests/test_api/test_methods/test_answer_shipping_query.py::TestAnswerShippingQuery::test_method 0.00
No log output captured.
Passed tests/test_api/test_methods/test_answer_shipping_query.py::TestAnswerShippingQuery::test_bot_method 0.00
No log output captured.
Passed tests/test_api/test_methods/test_base.py::TestPrepareParseMode::test_default_parse_mode[None-data0-None] 0.00
No log output captured.
Passed tests/test_api/test_methods/test_base.py::TestPrepareParseMode::test_default_parse_mode[HTML-data1-HTML] 0.00
No log output captured.
Passed tests/test_api/test_methods/test_base.py::TestPrepareParseMode::test_default_parse_mode[Markdown-data2-Markdown] 0.00
No log output captured.
Passed tests/test_api/test_methods/test_base.py::TestPrepareParseMode::test_default_parse_mode[None-data3-HTML] 0.00
No log output captured.
Passed tests/test_api/test_methods/test_base.py::TestPrepareParseMode::test_default_parse_mode[HTML-data4-HTML] 0.00
No log output captured.
Passed tests/test_api/test_methods/test_base.py::TestPrepareParseMode::test_default_parse_mode[Markdown-data5-HTML] 0.00
No log output captured.
Passed tests/test_api/test_methods/test_base.py::TestPrepareParseMode::test_list 0.00
No log output captured.
Passed tests/test_api/test_methods/test_base.py::TestPrepareParseMode::test_bot_not_in_context 0.00
No log output captured.
Passed tests/test_api/test_methods/test_create_new_sticker_set.py::TestCreateNewStickerSet::test_method 0.00
No log output captured.
Passed tests/test_api/test_methods/test_create_new_sticker_set.py::TestCreateNewStickerSet::test_bot_method 0.00
No log output captured.
Passed tests/test_api/test_methods/test_delete_chat_photo.py::TestDeleteChatPhoto::test_method 0.00
No log output captured.
Passed tests/test_api/test_methods/test_delete_chat_photo.py::TestDeleteChatPhoto::test_bot_method 0.00
No log output captured.
Passed tests/test_api/test_methods/test_delete_chat_sticker_set.py::TestDeleteChatStickerSet::test_method 0.00
No log output captured.
Passed tests/test_api/test_methods/test_delete_chat_sticker_set.py::TestDeleteChatStickerSet::test_bot_method 0.00
No log output captured.
Passed tests/test_api/test_methods/test_delete_message.py::TestDeleteMessage::test_method 0.00
No log output captured.
Passed tests/test_api/test_methods/test_delete_message.py::TestDeleteMessage::test_bot_method 0.00
No log output captured.
Passed tests/test_api/test_methods/test_delete_sticker_from_set.py::TestDeleteStickerFromSet::test_method 0.00
No log output captured.
Passed tests/test_api/test_methods/test_delete_sticker_from_set.py::TestDeleteStickerFromSet::test_bot_method 0.00
No log output captured.
Passed tests/test_api/test_methods/test_delete_webhook.py::TestDeleteWebhook::test_method 0.00
No log output captured.
Passed tests/test_api/test_methods/test_delete_webhook.py::TestDeleteWebhook::test_bot_method 0.00
No log output captured.
Passed tests/test_api/test_methods/test_edit_message_caption.py::TestEditMessageCaption::test_method 0.01
No log output captured.
Passed tests/test_api/test_methods/test_edit_message_caption.py::TestEditMessageCaption::test_bot_method 0.00
No log output captured.
Passed tests/test_api/test_methods/test_edit_message_live_location.py::TestEditMessageLiveLocation::test_method 0.04
No log output captured.
Passed tests/test_api/test_methods/test_edit_message_live_location.py::TestEditMessageLiveLocation::test_bot_method 0.00
No log output captured.
Passed tests/test_api/test_methods/test_edit_message_media.py::TestEditMessageMedia::test_method 0.00
No log output captured.
Passed tests/test_api/test_methods/test_edit_message_media.py::TestEditMessageMedia::test_bot_method 0.00
No log output captured.
Passed tests/test_api/test_methods/test_edit_message_reply_markup.py::TestEditMessageReplyMarkup::test_method 0.00
No log output captured.
Passed tests/test_api/test_methods/test_edit_message_reply_markup.py::TestEditMessageReplyMarkup::test_bot_method 0.00
No log output captured.
Passed tests/test_api/test_methods/test_edit_message_text.py::TestEditMessageText::test_method 0.00
No log output captured.
Passed tests/test_api/test_methods/test_edit_message_text.py::TestEditMessageText::test_bot_method 0.00
No log output captured.
Passed tests/test_api/test_methods/test_export_chat_invite_link.py::TestExportChatInviteLink::test_method 0.00
No log output captured.
Passed tests/test_api/test_methods/test_export_chat_invite_link.py::TestExportChatInviteLink::test_bot_method 0.00
No log output captured.
Passed tests/test_api/test_methods/test_forward_message.py::TestForwardMessage::test_method 0.00
No log output captured.
Passed tests/test_api/test_methods/test_forward_message.py::TestForwardMessage::test_bot_method 0.00
No log output captured.
Passed tests/test_api/test_methods/test_get_chat.py::TestGetChat::test_method 0.00
No log output captured.
Passed tests/test_api/test_methods/test_get_chat.py::TestGetChat::test_bot_method 0.00
No log output captured.
Passed tests/test_api/test_methods/test_get_chat_administrators.py::TestGetChatAdministrators::test_method 0.00
No log output captured.
Passed tests/test_api/test_methods/test_get_chat_administrators.py::TestGetChatAdministrators::test_bot_method 0.00
No log output captured.
Passed tests/test_api/test_methods/test_get_chat_member.py::TestGetChatMember::test_method 0.00
No log output captured.
Passed tests/test_api/test_methods/test_get_chat_member.py::TestGetChatMember::test_bot_method 0.00
No log output captured.
Passed tests/test_api/test_methods/test_get_chat_members_count.py::TestGetChatMembersCount::test_method 0.00
No log output captured.
Passed tests/test_api/test_methods/test_get_chat_members_count.py::TestGetChatMembersCount::test_bot_method 0.00
No log output captured.
Passed tests/test_api/test_methods/test_get_file.py::TestGetFile::test_method 0.00
No log output captured.
Passed tests/test_api/test_methods/test_get_file.py::TestGetFile::test_bot_method 0.00
No log output captured.
Passed tests/test_api/test_methods/test_get_game_high_scores.py::TestGetGameHighScores::test_method 0.00
No log output captured.
Passed tests/test_api/test_methods/test_get_game_high_scores.py::TestGetGameHighScores::test_bot_method 0.00
No log output captured.
Passed tests/test_api/test_methods/test_get_me.py::TestGetMe::test_method 0.00
No log output captured.
Passed tests/test_api/test_methods/test_get_me.py::TestGetMe::test_bot_method 0.00
No log output captured.
Passed tests/test_api/test_methods/test_get_me.py::TestGetMe::test_me_property 0.00
No log output captured.
Passed tests/test_api/test_methods/test_get_my_commands.py::TestGetMyCommands::test_method 0.00
No log output captured.
Passed tests/test_api/test_methods/test_get_my_commands.py::TestGetMyCommands::test_bot_method 0.00
No log output captured.
Passed tests/test_api/test_methods/test_get_sticker_set.py::TestGetStickerSet::test_method 0.00
No log output captured.
Passed tests/test_api/test_methods/test_get_sticker_set.py::TestGetStickerSet::test_bot_method 0.00
No log output captured.
Passed tests/test_api/test_methods/test_get_updates.py::TestGetUpdates::test_method 0.00
No log output captured.
Passed tests/test_api/test_methods/test_get_updates.py::TestGetUpdates::test_bot_method 0.00
No log output captured.
Passed tests/test_api/test_methods/test_get_user_profile_photos.py::TestGetUserProfilePhotos::test_method 0.00
No log output captured.
Passed tests/test_api/test_methods/test_get_user_profile_photos.py::TestGetUserProfilePhotos::test_bot_method 0.00
No log output captured.
Passed tests/test_api/test_methods/test_get_webhook_info.py::TestGetWebhookInfo::test_method 0.00
No log output captured.
Passed tests/test_api/test_methods/test_get_webhook_info.py::TestGetWebhookInfo::test_bot_method 0.00
No log output captured.
Passed tests/test_api/test_methods/test_kick_chat_member.py::TestKickChatMember::test_method 0.00
No log output captured.
Passed tests/test_api/test_methods/test_kick_chat_member.py::TestKickChatMember::test_bot_method 0.00
No log output captured.
Passed tests/test_api/test_methods/test_leave_chat.py::TestLeaveChat::test_method 0.00
No log output captured.
Passed tests/test_api/test_methods/test_leave_chat.py::TestLeaveChat::test_bot_method 0.00
No log output captured.
Passed tests/test_api/test_methods/test_pin_chat_message.py::TestPinChatMessage::test_method 0.00
No log output captured.
Passed tests/test_api/test_methods/test_pin_chat_message.py::TestPinChatMessage::test_bot_method 0.00
No log output captured.
Passed tests/test_api/test_methods/test_promote_chat_member.py::TestPromoteChatMember::test_method 0.00
No log output captured.
Passed tests/test_api/test_methods/test_promote_chat_member.py::TestPromoteChatMember::test_bot_method 0.00
No log output captured.
Passed tests/test_api/test_methods/test_restrict_chat_member.py::TestRestrictChatMember::test_method 0.00
No log output captured.
Passed tests/test_api/test_methods/test_restrict_chat_member.py::TestRestrictChatMember::test_bot_method 0.00
No log output captured.
Passed tests/test_api/test_methods/test_send_animation.py::TestSendAnimation::test_method 0.00
No log output captured.
Passed tests/test_api/test_methods/test_send_animation.py::TestSendAnimation::test_bot_method 0.00
No log output captured.
Passed tests/test_api/test_methods/test_send_audio.py::TestSendAudio::test_method 0.00
No log output captured.
Passed tests/test_api/test_methods/test_send_audio.py::TestSendAudio::test_bot_method 0.00
No log output captured.
Passed tests/test_api/test_methods/test_send_chat_action.py::TestSendChatAction::test_method 0.00
No log output captured.
Passed tests/test_api/test_methods/test_send_chat_action.py::TestSendChatAction::test_bot_method 0.00
No log output captured.
Passed tests/test_api/test_methods/test_send_contact.py::TestSendContact::test_method 0.00
No log output captured.
Passed tests/test_api/test_methods/test_send_contact.py::TestSendContact::test_bot_method 0.00
No log output captured.
Passed tests/test_api/test_methods/test_send_dice.py::TestSendDice::test_method 0.00
No log output captured.
Passed tests/test_api/test_methods/test_send_dice.py::TestSendDice::test_bot_method 0.00
No log output captured.
Passed tests/test_api/test_methods/test_send_document.py::TestSendDocument::test_method 0.00
No log output captured.
Passed tests/test_api/test_methods/test_send_document.py::TestSendDocument::test_bot_method 0.00
No log output captured.
Passed tests/test_api/test_methods/test_send_game.py::TestSendGame::test_method 0.00
No log output captured.
Passed tests/test_api/test_methods/test_send_game.py::TestSendGame::test_bot_method 0.00
No log output captured.
Passed tests/test_api/test_methods/test_send_invoice.py::TestSendInvoice::test_method 0.00
No log output captured.
Passed tests/test_api/test_methods/test_send_invoice.py::TestSendInvoice::test_bot_method 0.00
No log output captured.
Passed tests/test_api/test_methods/test_send_location.py::TestSendLocation::test_method 0.00
No log output captured.
Passed tests/test_api/test_methods/test_send_location.py::TestSendLocation::test_bot_method 0.00
No log output captured.
Passed tests/test_api/test_methods/test_send_media_group.py::TestSendMediaGroup::test_method 0.01
No log output captured.
Passed tests/test_api/test_methods/test_send_media_group.py::TestSendMediaGroup::test_bot_method 0.00
No log output captured.
Passed tests/test_api/test_methods/test_send_message.py::TestSendMessage::test_method 0.00
No log output captured.
Passed tests/test_api/test_methods/test_send_message.py::TestSendMessage::test_bot_method 0.00
No log output captured.
Passed tests/test_api/test_methods/test_send_photo.py::TestSendPhoto::test_method 0.00
No log output captured.
Passed tests/test_api/test_methods/test_send_photo.py::TestSendPhoto::test_bot_method 0.00
No log output captured.
Passed tests/test_api/test_methods/test_send_poll.py::TestSendPoll::test_method 0.00
No log output captured.
Passed tests/test_api/test_methods/test_send_poll.py::TestSendPoll::test_bot_method 0.00
No log output captured.
Passed tests/test_api/test_methods/test_send_sticker.py::TestSendSticker::test_method 0.00
No log output captured.
Passed tests/test_api/test_methods/test_send_sticker.py::TestSendSticker::test_bot_method 0.00
No log output captured.
Passed tests/test_api/test_methods/test_send_venue.py::TestSendVenue::test_method 0.00
No log output captured.
Passed tests/test_api/test_methods/test_send_venue.py::TestSendVenue::test_bot_method 0.00
No log output captured.
Passed tests/test_api/test_methods/test_send_video.py::TestSendVideo::test_method 0.00
No log output captured.
Passed tests/test_api/test_methods/test_send_video.py::TestSendVideo::test_bot_method 0.00
No log output captured.
Passed tests/test_api/test_methods/test_send_video_note.py::TestSendVideoNote::test_method 0.00
No log output captured.
Passed tests/test_api/test_methods/test_send_video_note.py::TestSendVideoNote::test_bot_method 0.00
No log output captured.
Passed tests/test_api/test_methods/test_send_voice.py::TestSendVoice::test_method 0.00
No log output captured.
Passed tests/test_api/test_methods/test_send_voice.py::TestSendVoice::test_bot_method 0.00
No log output captured.
Passed tests/test_api/test_methods/test_set_chat_administrator_custom_title.py::TestSetChatTitle::test_method 0.00
No log output captured.
Passed tests/test_api/test_methods/test_set_chat_administrator_custom_title.py::TestSetChatTitle::test_bot_method 0.00
No log output captured.
Passed tests/test_api/test_methods/test_set_chat_description.py::TestSetChatDescription::test_method 0.00
No log output captured.
Passed tests/test_api/test_methods/test_set_chat_description.py::TestSetChatDescription::test_bot_method 0.00
No log output captured.
Passed tests/test_api/test_methods/test_set_chat_permissions.py::TestSetChatPermissions::test_method 0.00
No log output captured.
Passed tests/test_api/test_methods/test_set_chat_permissions.py::TestSetChatPermissions::test_bot_method 0.00
No log output captured.
Passed tests/test_api/test_methods/test_set_chat_photo.py::TestSetChatPhoto::test_method 0.00
No log output captured.
Passed tests/test_api/test_methods/test_set_chat_photo.py::TestSetChatPhoto::test_bot_method 0.00
No log output captured.
Passed tests/test_api/test_methods/test_set_chat_sticker_set.py::TestSetChatStickerSet::test_method 0.00
No log output captured.
Passed tests/test_api/test_methods/test_set_chat_sticker_set.py::TestSetChatStickerSet::test_bot_method 0.00
No log output captured.
Passed tests/test_api/test_methods/test_set_chat_title.py::TestSetChatTitle::test_method 0.00
No log output captured.
Passed tests/test_api/test_methods/test_set_chat_title.py::TestSetChatTitle::test_bot_method 0.00
No log output captured.
Passed tests/test_api/test_methods/test_set_game_score.py::TestSetGameScore::test_method 0.00
No log output captured.
Passed tests/test_api/test_methods/test_set_game_score.py::TestSetGameScore::test_bot_method 0.00
No log output captured.
Passed tests/test_api/test_methods/test_set_my_commands.py::TestSetMyCommands::test_method 0.00
No log output captured.
Passed tests/test_api/test_methods/test_set_my_commands.py::TestSetMyCommands::test_bot_method 0.00
No log output captured.
Passed tests/test_api/test_methods/test_set_passport_data_errors.py::TestSetPassportDataErrors::test_method 0.00
No log output captured.
Passed tests/test_api/test_methods/test_set_passport_data_errors.py::TestSetPassportDataErrors::test_bot_method 0.00
No log output captured.
Passed tests/test_api/test_methods/test_set_sticker_position_in_set.py::TestSetStickerPositionInSet::test_method 0.00
No log output captured.
Passed tests/test_api/test_methods/test_set_sticker_position_in_set.py::TestSetStickerPositionInSet::test_bot_method 0.00
No log output captured.
Passed tests/test_api/test_methods/test_set_sticker_set_thumb.py::TestSetStickerSetThumb::test_method 0.00
No log output captured.
Passed tests/test_api/test_methods/test_set_sticker_set_thumb.py::TestSetStickerSetThumb::test_bot_method 0.00
No log output captured.
Passed tests/test_api/test_methods/test_set_webhook.py::TestSetWebhook::test_method 0.00
No log output captured.
Passed tests/test_api/test_methods/test_set_webhook.py::TestSetWebhook::test_bot_method 0.00
No log output captured.
Passed tests/test_api/test_methods/test_stop_message_live_location.py::TestStopMessageLiveLocation::test_method 0.00
No log output captured.
Passed tests/test_api/test_methods/test_stop_message_live_location.py::TestStopMessageLiveLocation::test_bot_method 0.00
No log output captured.
Passed tests/test_api/test_methods/test_stop_poll.py::TestStopPoll::test_method 0.00
No log output captured.
Passed tests/test_api/test_methods/test_stop_poll.py::TestStopPoll::test_bot_method 0.00
No log output captured.
Passed tests/test_api/test_methods/test_unban_chat_member.py::TestUnbanChatMember::test_method 0.00
No log output captured.
Passed tests/test_api/test_methods/test_unban_chat_member.py::TestUnbanChatMember::test_bot_method 0.00
No log output captured.
Passed tests/test_api/test_methods/test_unpin_chat_message.py::TestUnpinChatMessage::test_method 0.00
No log output captured.
Passed tests/test_api/test_methods/test_unpin_chat_message.py::TestUnpinChatMessage::test_bot_method 0.00
No log output captured.
Passed tests/test_api/test_methods/test_upload_sticker_file.py::TestUploadStickerFile::test_method 0.00
No log output captured.
Passed tests/test_api/test_methods/test_upload_sticker_file.py::TestUploadStickerFile::test_bot_method 0.00
No log output captured.
Passed tests/test_api/test_types/test_callback_query.py::TestCallbackQuery::test_answer_alias 0.00
No log output captured.
Passed tests/test_api/test_types/test_chat_member.py::TestChatMember::test_is_chat_admin[administrator-True] 0.00
No log output captured.
Passed tests/test_api/test_types/test_chat_member.py::TestChatMember::test_is_chat_admin[creator-True] 0.00
No log output captured.
Passed tests/test_api/test_types/test_chat_member.py::TestChatMember::test_is_chat_admin[member-False] 0.00
No log output captured.
Passed tests/test_api/test_types/test_chat_member.py::TestChatMember::test_is_chat_member[administrator-True] 0.00
No log output captured.
Passed tests/test_api/test_types/test_chat_member.py::TestChatMember::test_is_chat_member[creator-True] 0.00
No log output captured.
Passed tests/test_api/test_types/test_chat_member.py::TestChatMember::test_is_chat_member[member-True] 0.00
No log output captured.
Passed tests/test_api/test_types/test_chat_member.py::TestChatMember::test_is_chat_member[restricted-True] 0.00
No log output captured.
Passed tests/test_api/test_types/test_chat_member.py::TestChatMember::test_is_chat_member[kicked-False] 0.00
No log output captured.
Passed tests/test_api/test_types/test_chat_member.py::TestChatMember::test_is_chat_member[left-False] 0.00
No log output captured.
Passed tests/test_api/test_types/test_inline_query.py::TestInlineQuery::test_answer_alias 0.00
No log output captured.
Passed tests/test_api/test_types/test_input_file.py::TestInputFile::test_fs_input_file 0.00
No log output captured.
Passed tests/test_api/test_types/test_input_file.py::TestInputFile::test_fs_input_file_readable 0.36
No log output captured.
Passed tests/test_api/test_types/test_input_file.py::TestInputFile::test_buffered_input_file 0.00
No log output captured.
Passed tests/test_api/test_types/test_input_file.py::TestInputFile::test_buffered_input_file_readable 0.00
No log output captured.
Passed tests/test_api/test_types/test_input_file.py::TestInputFile::test_buffered_input_file_from_file 0.00
No log output captured.
Passed tests/test_api/test_types/test_input_file.py::TestInputFile::test_buffered_input_file_from_file_readable 0.01
No log output captured.
Passed tests/test_api/test_types/test_input_file.py::TestInputFile::test_uri_input_file 0.00
No log output captured.
Passed tests/test_api/test_types/test_message.py::TestMessage::test_content_type[message0-text] 0.00
No log output captured.
Passed tests/test_api/test_types/test_message.py::TestMessage::test_content_type[message1-audio] 0.00
No log output captured.
Passed tests/test_api/test_types/test_message.py::TestMessage::test_content_type[message2-animation] 0.00
No log output captured.
Passed tests/test_api/test_types/test_message.py::TestMessage::test_content_type[message3-document] 0.00
No log output captured.
Passed tests/test_api/test_types/test_message.py::TestMessage::test_content_type[message4-game] 0.00
No log output captured.
Passed tests/test_api/test_types/test_message.py::TestMessage::test_content_type[message5-photo] 0.00
No log output captured.
Passed tests/test_api/test_types/test_message.py::TestMessage::test_content_type[message6-sticker] 0.00
-------------------------------Captured log setup-------------------------------
ERROR asyncio:connector.py:282 Unclosed connector connections: ['[(<aiohttp.client_proto.ResponseHandler object at 0x7f242d1b12e0>, 188.262)]'] connector: <aiohttp.connector.TCPConnector object at 0x7f242d1b08e0>
Passed tests/test_api/test_types/test_message.py::TestMessage::test_content_type[message7-video] 0.00
No log output captured.
Passed tests/test_api/test_types/test_message.py::TestMessage::test_content_type[message8-video_note] 0.00
No log output captured.
Passed tests/test_api/test_types/test_message.py::TestMessage::test_content_type[message9-voice] 0.00
No log output captured.
Passed tests/test_api/test_types/test_message.py::TestMessage::test_content_type[message10-contact] 0.00
No log output captured.
Passed tests/test_api/test_types/test_message.py::TestMessage::test_content_type[message11-venue] 0.00
No log output captured.
Passed tests/test_api/test_types/test_message.py::TestMessage::test_content_type[message12-location] 0.00
No log output captured.
Passed tests/test_api/test_types/test_message.py::TestMessage::test_content_type[message13-new_chat_members] 0.00
No log output captured.
Passed tests/test_api/test_types/test_message.py::TestMessage::test_content_type[message14-left_chat_member] 0.00
No log output captured.
Passed tests/test_api/test_types/test_message.py::TestMessage::test_content_type[message15-invoice] 0.00
No log output captured.
Passed tests/test_api/test_types/test_message.py::TestMessage::test_content_type[message16-successful_payment] 0.00
No log output captured.
Passed tests/test_api/test_types/test_message.py::TestMessage::test_content_type[message17-connected_website] 0.00
No log output captured.
Passed tests/test_api/test_types/test_message.py::TestMessage::test_content_type[message18-migrate_from_chat_id] 0.00
No log output captured.
Passed tests/test_api/test_types/test_message.py::TestMessage::test_content_type[message19-migrate_to_chat_id] 0.00
No log output captured.
Passed tests/test_api/test_types/test_message.py::TestMessage::test_content_type[message20-pinned_message] 0.00
No log output captured.
Passed tests/test_api/test_types/test_message.py::TestMessage::test_content_type[message21-new_chat_title] 0.00
No log output captured.
Passed tests/test_api/test_types/test_message.py::TestMessage::test_content_type[message22-new_chat_photo] 0.00
No log output captured.
Passed tests/test_api/test_types/test_message.py::TestMessage::test_content_type[message23-delete_chat_photo] 0.00
No log output captured.
Passed tests/test_api/test_types/test_message.py::TestMessage::test_content_type[message24-group_chat_created] 0.00
No log output captured.
Passed tests/test_api/test_types/test_message.py::TestMessage::test_content_type[message25-passport_data] 0.00
No log output captured.
Passed tests/test_api/test_types/test_message.py::TestMessage::test_content_type[message26-poll] 0.00
No log output captured.
Passed tests/test_api/test_types/test_message.py::TestMessage::test_content_type[message27-dice] 0.00
No log output captured.
Passed tests/test_api/test_types/test_message.py::TestMessage::test_content_type[message28-unknown] 0.00
No log output captured.
Passed tests/test_api/test_types/test_message.py::TestMessage::test_reply_answer_aliases[reply-animation-kwargs0-SendAnimation] 0.00
No log output captured.
Passed tests/test_api/test_types/test_message.py::TestMessage::test_reply_answer_aliases[reply-audio-kwargs1-SendAudio] 0.00
No log output captured.
Passed tests/test_api/test_types/test_message.py::TestMessage::test_reply_answer_aliases[reply-contact-kwargs2-SendContact] 0.00
No log output captured.
Passed tests/test_api/test_types/test_message.py::TestMessage::test_reply_answer_aliases[reply-document-kwargs3-SendDocument] 0.00
No log output captured.
Passed tests/test_api/test_types/test_message.py::TestMessage::test_reply_answer_aliases[reply-game-kwargs4-SendGame] 0.00
No log output captured.
Passed tests/test_api/test_types/test_message.py::TestMessage::test_reply_answer_aliases[reply-invoice-kwargs5-SendInvoice] 0.00
No log output captured.
Passed tests/test_api/test_types/test_message.py::TestMessage::test_reply_answer_aliases[reply-location-kwargs6-SendLocation] 0.00
No log output captured.
Passed tests/test_api/test_types/test_message.py::TestMessage::test_reply_answer_aliases[reply-media_group-kwargs7-SendMediaGroup] 0.00
No log output captured.
Passed tests/test_api/test_types/test_message.py::TestMessage::test_reply_answer_aliases[reply--kwargs8-SendMessage] 0.00
No log output captured.
Passed tests/test_api/test_types/test_message.py::TestMessage::test_reply_answer_aliases[reply-photo-kwargs9-SendPhoto] 0.00
No log output captured.
Passed tests/test_api/test_types/test_message.py::TestMessage::test_reply_answer_aliases[reply-poll-kwargs10-SendPoll] 0.00
No log output captured.
Passed tests/test_api/test_types/test_message.py::TestMessage::test_reply_answer_aliases[reply-dice-kwargs11-SendDice] 0.00
No log output captured.
Passed tests/test_api/test_types/test_message.py::TestMessage::test_reply_answer_aliases[reply-sticker-kwargs12-SendSticker] 0.00
No log output captured.
Passed tests/test_api/test_types/test_message.py::TestMessage::test_reply_answer_aliases[reply-sticker-kwargs13-SendSticker] 0.00
No log output captured.
Passed tests/test_api/test_types/test_message.py::TestMessage::test_reply_answer_aliases[reply-venue-kwargs14-SendVenue] 0.00
No log output captured.
Passed tests/test_api/test_types/test_message.py::TestMessage::test_reply_answer_aliases[reply-video-kwargs15-SendVideo] 0.00
No log output captured.
Passed tests/test_api/test_types/test_message.py::TestMessage::test_reply_answer_aliases[reply-video_note-kwargs16-SendVideoNote] 0.00
No log output captured.
Passed tests/test_api/test_types/test_message.py::TestMessage::test_reply_answer_aliases[reply-voice-kwargs17-SendVoice] 0.00
No log output captured.
Passed tests/test_api/test_types/test_message.py::TestMessage::test_reply_answer_aliases[answer-animation-kwargs0-SendAnimation] 0.00
No log output captured.
Passed tests/test_api/test_types/test_message.py::TestMessage::test_reply_answer_aliases[answer-audio-kwargs1-SendAudio] 0.00
No log output captured.
Passed tests/test_api/test_types/test_message.py::TestMessage::test_reply_answer_aliases[answer-contact-kwargs2-SendContact] 0.00
No log output captured.
Passed tests/test_api/test_types/test_message.py::TestMessage::test_reply_answer_aliases[answer-document-kwargs3-SendDocument] 0.00
No log output captured.
Passed tests/test_api/test_types/test_message.py::TestMessage::test_reply_answer_aliases[answer-game-kwargs4-SendGame] 0.00
No log output captured.
Passed tests/test_api/test_types/test_message.py::TestMessage::test_reply_answer_aliases[answer-invoice-kwargs5-SendInvoice] 0.00
No log output captured.
Passed tests/test_api/test_types/test_message.py::TestMessage::test_reply_answer_aliases[answer-location-kwargs6-SendLocation] 0.00
No log output captured.
Passed tests/test_api/test_types/test_message.py::TestMessage::test_reply_answer_aliases[answer-media_group-kwargs7-SendMediaGroup] 0.00
No log output captured.
Passed tests/test_api/test_types/test_message.py::TestMessage::test_reply_answer_aliases[answer--kwargs8-SendMessage] 0.00
No log output captured.
Passed tests/test_api/test_types/test_message.py::TestMessage::test_reply_answer_aliases[answer-photo-kwargs9-SendPhoto] 0.00
No log output captured.
Passed tests/test_api/test_types/test_message.py::TestMessage::test_reply_answer_aliases[answer-poll-kwargs10-SendPoll] 0.00
No log output captured.
Passed tests/test_api/test_types/test_message.py::TestMessage::test_reply_answer_aliases[answer-dice-kwargs11-SendDice] 0.00
No log output captured.
Passed tests/test_api/test_types/test_message.py::TestMessage::test_reply_answer_aliases[answer-sticker-kwargs12-SendSticker] 0.00
No log output captured.
Passed tests/test_api/test_types/test_message.py::TestMessage::test_reply_answer_aliases[answer-sticker-kwargs13-SendSticker] 0.00
No log output captured.
Passed tests/test_api/test_types/test_message.py::TestMessage::test_reply_answer_aliases[answer-venue-kwargs14-SendVenue] 0.00
No log output captured.
Passed tests/test_api/test_types/test_message.py::TestMessage::test_reply_answer_aliases[answer-video-kwargs15-SendVideo] 0.00
No log output captured.
Passed tests/test_api/test_types/test_message.py::TestMessage::test_reply_answer_aliases[answer-video_note-kwargs16-SendVideoNote] 0.00
No log output captured.
Passed tests/test_api/test_types/test_message.py::TestMessage::test_reply_answer_aliases[answer-voice-kwargs17-SendVoice] 0.00
No log output captured.
Passed tests/test_api/test_types/test_pre_checkout_query.py::TestPreCheckoutQuery::test_answer_alias 0.00
No log output captured.
Passed tests/test_api/test_types/test_reply_keyboard_remove.py::TestReplyKeyboardRemove::test_remove_keyboard_default_is_true 0.00
No log output captured.
Passed tests/test_api/test_types/test_reply_keyboard_remove.py::TestReplyKeyboardRemove::test_remove_keyboard_values[kwargs0-True] 0.00
No log output captured.
Passed tests/test_api/test_types/test_reply_keyboard_remove.py::TestReplyKeyboardRemove::test_remove_keyboard_values[kwargs1-True] 0.00
No log output captured.
Passed tests/test_api/test_types/test_reply_keyboard_remove.py::TestReplyKeyboardRemove::test_remove_keyboard_values[kwargs2-False] 0.00
No log output captured.
Passed tests/test_api/test_types/test_shipping_query.py::TestInlineQuery::test_answer_alias 0.00
No log output captured.
Passed tests/test_api/test_types/test_user.py::TestUser::test_full_name[User-None-User] 0.00
No log output captured.
Passed tests/test_api/test_types/test_user.py::TestUser::test_full_name[-None-] 0.00
No log output captured.
Passed tests/test_api/test_types/test_user.py::TestUser::test_full_name[ -None- ] 0.00
No log output captured.
Passed tests/test_api/test_types/test_user.py::TestUser::test_full_name[User-Name-User Name] 0.00
No log output captured.
Passed tests/test_api/test_types/test_user.py::TestUser::test_full_name[User- -User ] 0.00
No log output captured.
Passed tests/test_api/test_types/test_user.py::TestUser::test_full_name[ - - ] 0.00
No log output captured.
Passed tests/test_dispatcher/test_deprecated.py::test_deprecated_handlers_name[edited_channel_post_handler] 0.00
No log output captured.
Passed tests/test_dispatcher/test_deprecated.py::test_deprecated_handlers_name[poll_handler] 0.00
No log output captured.
Passed tests/test_dispatcher/test_deprecated.py::test_deprecated_handlers_name[channel_post_handler] 0.00
No log output captured.
Passed tests/test_dispatcher/test_deprecated.py::test_deprecated_handlers_name[callback_query_handler] 0.00
No log output captured.
Passed tests/test_dispatcher/test_deprecated.py::test_deprecated_handlers_name[poll_answer_handler] 0.00
No log output captured.
Passed tests/test_dispatcher/test_deprecated.py::test_deprecated_handlers_name[update_handler] 0.00
No log output captured.
Passed tests/test_dispatcher/test_deprecated.py::test_deprecated_handlers_name[errors_handler] 0.00
No log output captured.
Passed tests/test_dispatcher/test_deprecated.py::test_deprecated_handlers_name[edited_message_handler] 0.00
No log output captured.
Passed tests/test_dispatcher/test_deprecated.py::test_deprecated_handlers_name[message_handler] 0.00
No log output captured.
Passed tests/test_dispatcher/test_deprecated.py::test_deprecated_handlers_name[chosen_inline_result_handler] 0.00
No log output captured.
Passed tests/test_dispatcher/test_deprecated.py::test_deprecated_handlers_name[shipping_query_handler] 0.00
No log output captured.
Passed tests/test_dispatcher/test_deprecated.py::test_deprecated_handlers_name[inline_query_handler] 0.00
No log output captured.
Passed tests/test_dispatcher/test_deprecated.py::test_deprecated_handlers_name[pre_checkout_query_handler] 0.00
No log output captured.
Passed tests/test_dispatcher/test_dispatcher.py::TestDispatcher::test_parent_router 0.00
No log output captured.
Passed tests/test_dispatcher/test_dispatcher.py::TestDispatcher::test_feed_update 0.00
No log output captured.
Passed tests/test_dispatcher/test_dispatcher.py::TestDispatcher::test_feed_raw_update 0.00
No log output captured.
Passed tests/test_dispatcher/test_dispatcher.py::TestDispatcher::test_listen_updates 0.00
No log output captured.
Passed tests/test_dispatcher/test_dispatcher.py::TestDispatcher::test_silent_call_request 0.00
-------------------------------Captured log call--------------------------------
ERROR aiogram.dispatcher:dispatcher.py:115 Failed to make answer: TelegramAPIError: Kaboom
Passed tests/test_dispatcher/test_dispatcher.py::TestDispatcher::test_process_update_empty 0.00
No log output captured.
Passed tests/test_dispatcher/test_dispatcher.py::TestDispatcher::test_process_update_handled 0.00
No log output captured.
Passed tests/test_dispatcher/test_dispatcher.py::TestDispatcher::test_process_update_call_request 0.00
------------------------------Captured stdout call------------------------------
True
Passed tests/test_dispatcher/test_dispatcher.py::TestDispatcher::test_process_update_exception 0.00
-------------------------------Captured log call--------------------------------
ERROR aiogram.dispatcher:dispatcher.py:138 Cause exception while process update id=42 by bot id=42 Exception: Kaboom! Traceback (most recent call last): File "/home/runner/work/aiogram/aiogram/aiogram/dispatcher/dispatcher.py", line 131, in _process_update response = await self.feed_update(bot, update, **kwargs) File "/home/runner/work/aiogram/aiogram/aiogram/dispatcher/dispatcher.py", line 63, in feed_update response = await self.update.trigger(update, bot=bot, **kwargs) File "/home/runner/work/aiogram/aiogram/aiogram/dispatcher/event/telegram.py", line 121, in trigger return await wrapped_outer(event, kwargs) File "/home/runner/work/aiogram/aiogram/aiogram/dispatcher/middlewares/error.py", line 24, in __call__ return await handler(event, data) File "/home/runner/work/aiogram/aiogram/aiogram/dispatcher/middlewares/user_context.py", line 17, in __call__ return await handler(event, data) File "/home/runner/work/aiogram/aiogram/aiogram/dispatcher/event/telegram.py", line 130, in _trigger return await wrapped_inner(event, kwargs) File "/home/runner/work/aiogram/aiogram/aiogram/dispatcher/event/handler.py", line 44, in call return await wrapped() File "/home/runner/work/aiogram/aiogram/tests/test_dispatcher/test_dispatcher.py", line 172, in update_handler raise Exception("Kaboom!") Exception: Kaboom!
Passed tests/test_dispatcher/test_dispatcher.py::TestDispatcher::test_polling 0.00
No log output captured.
Passed tests/test_dispatcher/test_dispatcher.py::TestDispatcher::test_start_polling 0.01
No log output captured.
Passed tests/test_dispatcher/test_dispatcher.py::TestDispatcher::test_run_polling 0.00
No log output captured.
Passed tests/test_dispatcher/test_dispatcher.py::TestDispatcher::test_feed_webhook_update_fast_process 1.50
No log output captured.
Passed tests/test_dispatcher/test_dispatcher.py::TestDispatcher::test_feed_webhook_update_slow_process 2.01
No log output captured.
Passed tests/test_dispatcher/test_dispatcher.py::TestDispatcher::test_feed_webhook_update_fast_process_error 2.00
-------------------------------Captured log call--------------------------------
ERROR aiogram.dispatcher:dispatcher.py:165 Cause exception while process update id=42 by bot id=42 Exception: 42 Traceback (most recent call last): File "/home/runner/work/aiogram/aiogram/aiogram/dispatcher/dispatcher.py", line 163, in _feed_webhook_update return await self.feed_update(bot, update, **kwargs) File "/home/runner/work/aiogram/aiogram/aiogram/dispatcher/dispatcher.py", line 63, in feed_update response = await self.update.trigger(update, bot=bot, **kwargs) File "/home/runner/work/aiogram/aiogram/aiogram/dispatcher/event/telegram.py", line 121, in trigger return await wrapped_outer(event, kwargs) File "/home/runner/work/aiogram/aiogram/aiogram/dispatcher/middlewares/error.py", line 24, in __call__ return await handler(event, data) File "/home/runner/work/aiogram/aiogram/aiogram/dispatcher/middlewares/user_context.py", line 17, in __call__ return await handler(event, data) File "/home/runner/work/aiogram/aiogram/aiogram/dispatcher/event/telegram.py", line 130, in _trigger return await wrapped_inner(event, kwargs) File "/home/runner/work/aiogram/aiogram/aiogram/dispatcher/event/handler.py", line 44, in call return await wrapped() File "/home/runner/work/aiogram/aiogram/aiogram/dispatcher/router.py", line 215, in _listen_update response = await observer.trigger(event, update=update, **kwargs) File "/home/runner/work/aiogram/aiogram/aiogram/dispatcher/event/telegram.py", line 121, in trigger return await wrapped_outer(event, kwargs) File "/home/runner/work/aiogram/aiogram/aiogram/dispatcher/event/telegram.py", line 130, in _trigger return await wrapped_inner(event, kwargs) File "/home/runner/work/aiogram/aiogram/aiogram/dispatcher/event/handler.py", line 44, in call return await wrapped() File "/home/runner/work/aiogram/aiogram/tests/test_dispatcher/test_dispatcher.py", line 29, in invalid_message_handler raise Exception(42) Exception: 42 ERROR asyncio:plugin.py:156 Exception in callback <function Dispatcher.feed_webhook_update.<locals>.process_response at 0x7f242d0f34c0> handle: <Handle Dispatcher.feed_webhook_update.<locals>.process_response> Traceback (most recent call last): File "uvloop/cbhandles.pyx", line 70, in uvloop.loop.Handle._run File "/home/runner/work/aiogram/aiogram/aiogram/dispatcher/dispatcher.py", line 206, in process_response raise e File "/home/runner/work/aiogram/aiogram/aiogram/dispatcher/dispatcher.py", line 204, in process_response result = task.result() File "/home/runner/work/aiogram/aiogram/aiogram/dispatcher/dispatcher.py", line 163, in _feed_webhook_update return await self.feed_update(bot, update, **kwargs) File "/home/runner/work/aiogram/aiogram/aiogram/dispatcher/dispatcher.py", line 63, in feed_update response = await self.update.trigger(update, bot=bot, **kwargs) File "/home/runner/work/aiogram/aiogram/aiogram/dispatcher/event/telegram.py", line 121, in trigger return await wrapped_outer(event, kwargs) File "/home/runner/work/aiogram/aiogram/aiogram/dispatcher/middlewares/error.py", line 24, in __call__ return await handler(event, data) File "/home/runner/work/aiogram/aiogram/aiogram/dispatcher/middlewares/user_context.py", line 17, in __call__ return await handler(event, data) File "/home/runner/work/aiogram/aiogram/aiogram/dispatcher/event/telegram.py", line 130, in _trigger return await wrapped_inner(event, kwargs) File "/home/runner/work/aiogram/aiogram/aiogram/dispatcher/event/handler.py", line 44, in call return await wrapped() File "/home/runner/work/aiogram/aiogram/aiogram/dispatcher/router.py", line 215, in _listen_update response = await observer.trigger(event, update=update, **kwargs) File "/home/runner/work/aiogram/aiogram/aiogram/dispatcher/event/telegram.py", line 121, in trigger return await wrapped_outer(event, kwargs) File "/home/runner/work/aiogram/aiogram/aiogram/dispatcher/event/telegram.py", line 130, in _trigger return await wrapped_inner(event, kwargs) File "/home/runner/work/aiogram/aiogram/aiogram/dispatcher/event/handler.py", line 44, in call return await wrapped() File "/home/runner/work/aiogram/aiogram/tests/test_dispatcher/test_dispatcher.py", line 29, in invalid_message_handler raise Exception(42) Exception: 42
Passed tests/test_dispatcher/test_router.py::TestRouter::test_including_routers 0.00
No log output captured.
Passed tests/test_dispatcher/test_router.py::TestRouter::test_include_router_code_has_no_effect 0.00
No log output captured.
Passed tests/test_dispatcher/test_router.py::TestRouter::test_include_router_by_string 0.00
No log output captured.
Passed tests/test_dispatcher/test_router.py::TestRouter::test_include_router_by_string_bad_type 0.00
No log output captured.
Passed tests/test_dispatcher/test_router.py::TestRouter::test_set_parent_router_bad_type 0.00
No log output captured.
Passed tests/test_dispatcher/test_router.py::TestRouter::test_observers_config 0.00
No log output captured.
Passed tests/test_dispatcher/test_router.py::TestRouter::test_listen_update[message-update0-True-True] 0.00
No log output captured.
Passed tests/test_dispatcher/test_router.py::TestRouter::test_listen_update[edited_message-update1-True-True] 0.00
No log output captured.
Passed tests/test_dispatcher/test_router.py::TestRouter::test_listen_update[channel_post-update2-True-False] 0.00
No log output captured.
Passed tests/test_dispatcher/test_router.py::TestRouter::test_listen_update[edited_channel_post-update3-True-False] 0.00
No log output captured.
Passed tests/test_dispatcher/test_router.py::TestRouter::test_listen_update[inline_query-update4-False-True] 0.00
No log output captured.
Passed tests/test_dispatcher/test_router.py::TestRouter::test_listen_update[chosen_inline_result-update5-False-True] 0.00
No log output captured.
Passed tests/test_dispatcher/test_router.py::TestRouter::test_listen_update[callback_query-update6-False-True] 0.00
No log output captured.
Passed tests/test_dispatcher/test_router.py::TestRouter::test_listen_update[callback_query-update7-True-True] 0.00
No log output captured.
Passed tests/test_dispatcher/test_router.py::TestRouter::test_listen_update[shipping_query-update8-False-True] 0.00
No log output captured.
Passed tests/test_dispatcher/test_router.py::TestRouter::test_listen_update[pre_checkout_query-update9-False-True] 0.00
No log output captured.
Passed tests/test_dispatcher/test_router.py::TestRouter::test_listen_update[poll-update10-False-False] 0.00
No log output captured.
Passed tests/test_dispatcher/test_router.py::TestRouter::test_listen_update[poll_answer-update11-False-True] 0.00
No log output captured.
Passed tests/test_dispatcher/test_router.py::TestRouter::test_listen_unknown_update 0.00
No log output captured.
Passed tests/test_dispatcher/test_router.py::TestRouter::test_listen_unhandled_update 0.00
No log output captured.
Passed tests/test_dispatcher/test_router.py::TestRouter::test_nested_router_listen_update 0.00
No log output captured.
Passed tests/test_dispatcher/test_router.py::TestRouter::test_emit_startup 0.00
No log output captured.
Passed tests/test_dispatcher/test_router.py::TestRouter::test_emit_shutdown 0.00
No log output captured.
Passed tests/test_dispatcher/test_router.py::TestRouter::test_skip 0.00
No log output captured.
Passed tests/test_dispatcher/test_router.py::TestRouter::test_exception_handler_catch_exceptions 0.00
No log output captured.
Passed tests/test_dispatcher/test_event/test_event.py::TestEventObserver::test_register_filters[5-my_handler-True] 0.00
No log output captured.
Passed tests/test_dispatcher/test_event/test_event.py::TestEventObserver::test_register_filters[5-my_handler-False] 0.00
No log output captured.
Passed tests/test_dispatcher/test_event/test_event.py::TestEventObserver::test_register_filters[3-my_handler-True] 0.00
No log output captured.
Passed tests/test_dispatcher/test_event/test_event.py::TestEventObserver::test_register_filters[3-my_handler-False] 0.00
No log output captured.
Passed tests/test_dispatcher/test_event/test_event.py::TestEventObserver::test_register_filters[2-my_handler-True] 0.00
No log output captured.
Passed tests/test_dispatcher/test_event/test_event.py::TestEventObserver::test_register_filters[2-my_handler-False] 0.00
No log output captured.
Passed tests/test_dispatcher/test_event/test_event.py::TestEventObserver::test_trigger 0.00
No log output captured.
Passed tests/test_dispatcher/test_event/test_handler.py::TestCallableMixin::test_init_awaitable[callback2] 0.00
No log output captured.
Passed tests/test_dispatcher/test_event/test_handler.py::TestCallableMixin::test_init_awaitable[callback1] 0.00
No log output captured.
Passed tests/test_dispatcher/test_event/test_handler.py::TestCallableMixin::test_init_not_awaitable[callback10] 0.00
No log output captured.
Passed tests/test_dispatcher/test_event/test_handler.py::TestCallableMixin::test_init_not_awaitable[callback11] 0.00
No log output captured.
Passed tests/test_dispatcher/test_event/test_handler.py::TestCallableMixin::test_init_args_spec[callback1-args0] 0.00
No log output captured.
Passed tests/test_dispatcher/test_event/test_handler.py::TestCallableMixin::test_init_args_spec[callback2-args1] 0.00
No log output captured.
Passed tests/test_dispatcher/test_event/test_handler.py::TestCallableMixin::test_init_args_spec[callback3-args2] 0.00
No log output captured.
Passed tests/test_dispatcher/test_event/test_handler.py::TestCallableMixin::test_init_args_spec[callback3-args3] 0.00
No log output captured.
Passed tests/test_dispatcher/test_event/test_handler.py::TestCallableMixin::test_init_args_spec[callback4-args4] 0.00
No log output captured.
Passed tests/test_dispatcher/test_event/test_handler.py::TestCallableMixin::test_init_decorated 0.00
No log output captured.
Passed tests/test_dispatcher/test_event/test_handler.py::TestCallableMixin::test_prepare_kwargs[callback1-kwargs0-result0] 0.00
No log output captured.
Passed tests/test_dispatcher/test_event/test_handler.py::TestCallableMixin::test_prepare_kwargs[callback2-kwargs1-result1] 0.00
No log output captured.
Passed tests/test_dispatcher/test_event/test_handler.py::TestCallableMixin::test_prepare_kwargs[callback3-kwargs2-result2] 0.00
No log output captured.
Passed tests/test_dispatcher/test_event/test_handler.py::TestCallableMixin::test_prepare_kwargs[callback3-kwargs3-result3] 0.00
No log output captured.
Passed tests/test_dispatcher/test_event/test_handler.py::TestCallableMixin::test_prepare_kwargs[callback4-kwargs4-result4] 0.00
No log output captured.
Passed tests/test_dispatcher/test_event/test_handler.py::TestCallableMixin::test_sync_call 0.00
No log output captured.
Passed tests/test_dispatcher/test_event/test_handler.py::TestCallableMixin::test_async_call 0.00
No log output captured.
Passed tests/test_dispatcher/test_event/test_handler.py::TestHandlerObject::test_check_with_bool_result 0.00
No log output captured.
Passed tests/test_dispatcher/test_event/test_handler.py::TestHandlerObject::test_check_with_dict_result 0.00
No log output captured.
Passed tests/test_dispatcher/test_event/test_handler.py::TestHandlerObject::test_check_with_combined_result 0.00
No log output captured.
Passed tests/test_dispatcher/test_event/test_handler.py::TestHandlerObject::test_check_rejected 0.00
No log output captured.
Passed tests/test_dispatcher/test_event/test_handler.py::TestHandlerObject::test_check_partial_rejected 0.00
No log output captured.
Passed tests/test_dispatcher/test_event/test_handler.py::TestHandlerObject::test_class_based_handler 0.00
No log output captured.
Passed tests/test_dispatcher/test_event/test_telegram.py::TestTelegramEventObserver::test_bind_filter 0.00
No log output captured.
Passed tests/test_dispatcher/test_event/test_telegram.py::TestTelegramEventObserver::test_resolve_filters_chain 0.00
No log output captured.
Passed tests/test_dispatcher/test_event/test_telegram.py::TestTelegramEventObserver::test_resolve_filters 0.00
No log output captured.
Passed tests/test_dispatcher/test_event/test_telegram.py::TestTelegramEventObserver::test_register 0.00
No log output captured.
Passed tests/test_dispatcher/test_event/test_telegram.py::TestTelegramEventObserver::test_register_decorator 0.00
No log output captured.
Passed tests/test_dispatcher/test_event/test_telegram.py::TestTelegramEventObserver::test_trigger 0.00
No log output captured.
Passed tests/test_dispatcher/test_event/test_telegram.py::TestTelegramEventObserver::test_register_filters_via_decorator[5-my_handler-filters0] 0.00
No log output captured.
Passed tests/test_dispatcher/test_event/test_telegram.py::TestTelegramEventObserver::test_register_filters_via_decorator[3-my_handler-filters1] 0.00
No log output captured.
Passed tests/test_dispatcher/test_event/test_telegram.py::TestTelegramEventObserver::test_register_filters_via_decorator[2-my_handler-filters2] 0.00
No log output captured.
Passed tests/test_dispatcher/test_event/test_telegram.py::TestTelegramEventObserver::test_trigger_right_context_in_handlers 0.00
No log output captured.
Passed tests/test_dispatcher/test_event/test_telegram.py::TestTelegramEventObserver::test_register_middleware[middleware] 0.00
No log output captured.
Passed tests/test_dispatcher/test_event/test_telegram.py::TestTelegramEventObserver::test_register_middleware[outer_middleware] 0.00
No log output captured.
Passed tests/test_dispatcher/test_filters/test_base.py::TestBaseFilter::test_awaitable 0.00
No log output captured.
Passed tests/test_dispatcher/test_filters/test_command.py::TestCommandFilter::test_convert_to_list 0.00
No log output captured.
Passed tests/test_dispatcher/test_filters/test_command.py::TestCommandFilter::test_parse_command 0.00
No log output captured.
Passed tests/test_dispatcher/test_filters/test_command.py::TestCommandFilter::test_call[message0-False] 0.00
No log output captured.
Passed tests/test_dispatcher/test_filters/test_command.py::TestCommandFilter::test_call[message1-True] 0.00
No log output captured.
Passed tests/test_dispatcher/test_filters/test_command.py::TestCommandObject::test_mentioned[obj0-True] 0.00
No log output captured.
Passed tests/test_dispatcher/test_filters/test_command.py::TestCommandObject::test_mentioned[obj1-False] 0.00
No log output captured.
Passed tests/test_dispatcher/test_filters/test_command.py::TestCommandObject::test_text[obj0-/command@mention args] 0.00
No log output captured.
Passed tests/test_dispatcher/test_filters/test_command.py::TestCommandObject::test_text[obj1-/command@mention] 0.00
No log output captured.
Passed tests/test_dispatcher/test_filters/test_command.py::TestCommandObject::test_text[obj2-/command args] 0.00
No log output captured.
Passed tests/test_dispatcher/test_filters/test_command.py::TestCommandObject::test_text[obj3-/command] 0.00
No log output captured.
Passed tests/test_dispatcher/test_filters/test_command.py::TestCommandObject::test_text[obj4-!command] 0.00
No log output captured.
Passed tests/test_dispatcher/test_filters/test_content_types.py::TestContentTypesFilter::test_validator_empty 0.00
No log output captured.
Passed tests/test_dispatcher/test_filters/test_content_types.py::TestContentTypesFilter::test_validator_empty_list 0.00
No log output captured.
Passed tests/test_dispatcher/test_filters/test_content_types.py::TestContentTypesFilter::test_convert_to_list 0.00
No log output captured.
Passed tests/test_dispatcher/test_filters/test_content_types.py::TestContentTypesFilter::test_validator_with_values[values0] 0.00
No log output captured.
Passed tests/test_dispatcher/test_filters/test_content_types.py::TestContentTypesFilter::test_validator_with_values[values1] 0.00
No log output captured.
Passed tests/test_dispatcher/test_filters/test_content_types.py::TestContentTypesFilter::test_validator_with_bad_values[values0] 0.00
No log output captured.
Passed tests/test_dispatcher/test_filters/test_content_types.py::TestContentTypesFilter::test_validator_with_bad_values[values1] 0.00
No log output captured.
Passed tests/test_dispatcher/test_filters/test_content_types.py::TestContentTypesFilter::test_validator_with_bad_values[values2] 0.00
No log output captured.
Passed tests/test_dispatcher/test_filters/test_content_types.py::TestContentTypesFilter::test_call[values0-text-True] 0.00
No log output captured.
Passed tests/test_dispatcher/test_filters/test_content_types.py::TestContentTypesFilter::test_call[values1-text-True] 0.00
No log output captured.
Passed tests/test_dispatcher/test_filters/test_content_types.py::TestContentTypesFilter::test_call[values2-text-False] 0.00
No log output captured.
Passed tests/test_dispatcher/test_filters/test_content_types.py::TestContentTypesFilter::test_call[values3-text-True] 0.00
No log output captured.
Passed tests/test_dispatcher/test_filters/test_content_types.py::TestContentTypesFilter::test_call[values4-text-True] 0.00
No log output captured.
Passed tests/test_dispatcher/test_filters/test_content_types.py::TestContentTypesFilter::test_call[values5-text-True] 0.00
No log output captured.
Passed tests/test_dispatcher/test_filters/test_exception.py::TestExceptionMessageFilter::test_converter[value0] 0.00
No log output captured.
Passed tests/test_dispatcher/test_filters/test_exception.py::TestExceptionMessageFilter::test_converter[value1] 0.00
No log output captured.
Passed tests/test_dispatcher/test_filters/test_exception.py::TestExceptionMessageFilter::test_match 0.00
No log output captured.
Passed tests/test_dispatcher/test_filters/test_exception.py::TestExceptionTypeFilter::test_check[exception0-False] 0.00
No log output captured.
Passed tests/test_dispatcher/test_filters/test_exception.py::TestExceptionTypeFilter::test_check[exception1-False] 0.00
No log output captured.
Passed tests/test_dispatcher/test_filters/test_exception.py::TestExceptionTypeFilter::test_check[exception2-False] 0.00
No log output captured.
Passed tests/test_dispatcher/test_filters/test_exception.py::TestExceptionTypeFilter::test_check[exception3-True] 0.00
No log output captured.
Passed tests/test_dispatcher/test_filters/test_exception.py::TestExceptionTypeFilter::test_check[exception4-True] 0.00
No log output captured.
Passed tests/test_dispatcher/test_filters/test_text.py::TestText::test_default_for_observer 0.00
No log output captured.
Passed tests/test_dispatcher/test_filters/test_text.py::TestText::test_validator_not_enough_arguments 0.00
No log output captured.
Passed tests/test_dispatcher/test_filters/test_text.py::TestText::test_validator_too_few_arguments[True-text-text_contains] 0.00
No log output captured.
Passed tests/test_dispatcher/test_filters/test_text.py::TestText::test_validator_too_few_arguments[True-text-text_startswith] 0.00
No log output captured.
Passed tests/test_dispatcher/test_filters/test_text.py::TestText::test_validator_too_few_arguments[True-text-text_endswith] 0.00
No log output captured.
Passed tests/test_dispatcher/test_filters/test_text.py::TestText::test_validator_too_few_arguments[True-text_contains-text] 0.00
No log output captured.
Passed tests/test_dispatcher/test_filters/test_text.py::TestText::test_validator_too_few_arguments[True-text_contains-text_startswith] 0.00
No log output captured.
Passed tests/test_dispatcher/test_filters/test_text.py::TestText::test_validator_too_few_arguments[True-text_contains-text_endswith] 0.00
No log output captured.
Passed tests/test_dispatcher/test_filters/test_text.py::TestText::test_validator_too_few_arguments[True-text_startswith-text] 0.00
No log output captured.
Passed tests/test_dispatcher/test_filters/test_text.py::TestText::test_validator_too_few_arguments[True-text_startswith-text_contains] 0.00
No log output captured.
Passed tests/test_dispatcher/test_filters/test_text.py::TestText::test_validator_too_few_arguments[True-text_startswith-text_endswith] 0.00
No log output captured.
Passed tests/test_dispatcher/test_filters/test_text.py::TestText::test_validator_too_few_arguments[True-text_endswith-text] 0.00
No log output captured.
Passed tests/test_dispatcher/test_filters/test_text.py::TestText::test_validator_too_few_arguments[True-text_endswith-text_contains] 0.00
No log output captured.
Passed tests/test_dispatcher/test_filters/test_text.py::TestText::test_validator_too_few_arguments[True-text_endswith-text_startswith] 0.00
No log output captured.
Passed tests/test_dispatcher/test_filters/test_text.py::TestText::test_validator_too_few_arguments[False-text-text_contains] 0.00
No log output captured.
Passed tests/test_dispatcher/test_filters/test_text.py::TestText::test_validator_too_few_arguments[False-text-text_startswith] 0.00
No log output captured.
Passed tests/test_dispatcher/test_filters/test_text.py::TestText::test_validator_too_few_arguments[False-text-text_endswith] 0.00
No log output captured.
Passed tests/test_dispatcher/test_filters/test_text.py::TestText::test_validator_too_few_arguments[False-text_contains-text] 0.00
No log output captured.
Passed tests/test_dispatcher/test_filters/test_text.py::TestText::test_validator_too_few_arguments[False-text_contains-text_startswith] 0.00
No log output captured.
Passed tests/test_dispatcher/test_filters/test_text.py::TestText::test_validator_too_few_arguments[False-text_contains-text_endswith] 0.00
No log output captured.
Passed tests/test_dispatcher/test_filters/test_text.py::TestText::test_validator_too_few_arguments[False-text_startswith-text] 0.00
No log output captured.
Passed tests/test_dispatcher/test_filters/test_text.py::TestText::test_validator_too_few_arguments[False-text_startswith-text_contains] 0.00
No log output captured.
Passed tests/test_dispatcher/test_filters/test_text.py::TestText::test_validator_too_few_arguments[False-text_startswith-text_endswith] 0.00
No log output captured.
Passed tests/test_dispatcher/test_filters/test_text.py::TestText::test_validator_too_few_arguments[False-text_endswith-text] 0.00
No log output captured.
Passed tests/test_dispatcher/test_filters/test_text.py::TestText::test_validator_too_few_arguments[False-text_endswith-text_contains] 0.00
No log output captured.
Passed tests/test_dispatcher/test_filters/test_text.py::TestText::test_validator_too_few_arguments[False-text_endswith-text_startswith] 0.00
No log output captured.
Passed tests/test_dispatcher/test_filters/test_text.py::TestText::test_validator_convert_to_list[str-text] 0.00
No log output captured.
Passed tests/test_dispatcher/test_filters/test_text.py::TestText::test_validator_convert_to_list[str-text_contains] 0.00
No log output captured.
Passed tests/test_dispatcher/test_filters/test_text.py::TestText::test_validator_convert_to_list[str-text_startswith] 0.00
No log output captured.
Passed tests/test_dispatcher/test_filters/test_text.py::TestText::test_validator_convert_to_list[str-text_endswith] 0.00
No log output captured.
Passed tests/test_dispatcher/test_filters/test_text.py::TestText::test_validator_convert_to_list[list-text] 0.00
No log output captured.
Passed tests/test_dispatcher/test_filters/test_text.py::TestText::test_validator_convert_to_list[list-text_contains] 0.00
No log output captured.
Passed tests/test_dispatcher/test_filters/test_text.py::TestText::test_validator_convert_to_list[list-text_startswith] 0.00
No log output captured.
Passed tests/test_dispatcher/test_filters/test_text.py::TestText::test_validator_convert_to_list[list-text_endswith] 0.00
No log output captured.
Passed tests/test_dispatcher/test_filters/test_text.py::TestText::test_validator_convert_to_list[tuple-text] 0.00
No log output captured.
Passed tests/test_dispatcher/test_filters/test_text.py::TestText::test_validator_convert_to_list[tuple-text_contains] 0.00
No log output captured.
Passed tests/test_dispatcher/test_filters/test_text.py::TestText::test_validator_convert_to_list[tuple-text_startswith] 0.00
No log output captured.
Passed tests/test_dispatcher/test_filters/test_text.py::TestText::test_validator_convert_to_list[tuple-text_endswith] 0.00
No log output captured.
Passed tests/test_dispatcher/test_filters/test_text.py::TestText::test_check_text[text-False-test-update_type0-False] 0.00
No log output captured.
Passed tests/test_dispatcher/test_filters/test_text.py::TestText::test_check_text[text-False-test-update_type1-True] 0.00
No log output captured.
Passed tests/test_dispatcher/test_filters/test_text.py::TestText::test_check_text[text-False-test-update_type2-True] 0.00
No log output captured.
Passed tests/test_dispatcher/test_filters/test_text.py::TestText::test_check_text[text-True-TEst-update_type3-True] 0.00
No log output captured.
Passed tests/test_dispatcher/test_filters/test_text.py::TestText::test_check_text[text-False-TEst-update_type4-False] 0.00
No log output captured.
Passed tests/test_dispatcher/test_filters/test_text.py::TestText::test_check_text[text_startswith-False-test-update_type5-True] 0.00
No log output captured.
Passed tests/test_dispatcher/test_filters/test_text.py::TestText::test_check_text[text_endswith-False-case-update_type6-True] 0.00
No log output captured.
Passed tests/test_dispatcher/test_filters/test_text.py::TestText::test_check_text[text_contains-False- -update_type7-True] 0.00
No log output captured.
Passed tests/test_dispatcher/test_filters/test_text.py::TestText::test_check_text[text_startswith-True-question-update_type8-True] 0.00
No log output captured.
Passed tests/test_dispatcher/test_filters/test_text.py::TestText::test_check_text[text_startswith-True-callback:-update_type9-True] 0.00
No log output captured.
Passed tests/test_dispatcher/test_filters/test_text.py::TestText::test_check_text[text_startswith-True-query-update_type10-True] 0.00
No log output captured.
Passed tests/test_dispatcher/test_filters/test_text.py::TestText::test_check_text[text-True-question-update_type11-True] 0.00
No log output captured.
Passed tests/test_dispatcher/test_filters/test_text.py::TestText::test_check_text[text-True-input_value12-update_type12-True] 0.00
No log output captured.
Passed tests/test_dispatcher/test_filters/test_text.py::TestText::test_check_text[text-True-input_value13-update_type13-False] 0.00
No log output captured.
Passed tests/test_dispatcher/test_handler/test_base.py::TestBaseClassBasedHandler::test_base_handler 0.10
No log output captured.
Passed tests/test_dispatcher/test_handler/test_base.py::TestBaseClassBasedHandler::test_bot_from_context 0.00
No log output captured.
Passed tests/test_dispatcher/test_handler/test_base.py::TestBaseClassBasedHandler::test_bot_from_data 0.00
No log output captured.
Passed tests/test_dispatcher/test_handler/test_base.py::TestBaseClassBasedHandler::test_update_from_data 0.00
No log output captured.
Passed tests/test_dispatcher/test_handler/test_callback_query.py::TestCallbackQueryHandler::test_attributes_aliases 0.00
No log output captured.
Passed tests/test_dispatcher/test_handler/test_chosen_inline_result.py::TestChosenInlineResultHandler::test_attributes_aliases 0.00
No log output captured.
Passed tests/test_dispatcher/test_handler/test_error.py::TestErrorHandler::test_extensions 0.00
No log output captured.
Passed tests/test_dispatcher/test_handler/test_inline_query.py::TestCallbackQueryHandler::test_attributes_aliases 0.00
No log output captured.
Passed tests/test_dispatcher/test_handler/test_message.py::TestClassBasedMessageHandler::test_message_handler 0.00
No log output captured.
Passed tests/test_dispatcher/test_handler/test_message.py::TestBaseMessageHandlerCommandMixin::test_command_accessible 0.00
No log output captured.
Passed tests/test_dispatcher/test_handler/test_message.py::TestBaseMessageHandlerCommandMixin::test_command_not_presented 0.00
No log output captured.
Passed tests/test_dispatcher/test_handler/test_poll.py::TestShippingQueryHandler::test_attributes_aliases 0.00
No log output captured.
Passed tests/test_dispatcher/test_handler/test_pre_checkout_query.py::TestPreCheckoutQueryHandler::test_attributes_aliases 0.00
No log output captured.
Passed tests/test_dispatcher/test_handler/test_shipping_query.py::TestShippingQueryHandler::test_attributes_aliases 0.00
No log output captured.
Passed tests/test_utils/test_helper.py::TestHelper::test_items_all 0.00
No log output captured.
Passed tests/test_utils/test_helper.py::TestHelper::test_listed_items_all 0.00
No log output captured.
Passed tests/test_utils/test_helper.py::TestHelper::test_listed_items_combinations 0.00
No log output captured.
Passed tests/test_utils/test_helper.py::TestHelper::test_wrong_name 0.00
No log output captured.
Passed tests/test_utils/test_helper.py::TestHelper::test_not_a_helper_subclass 0.00
No log output captured.
Passed tests/test_utils/test_helper.py::TestHelperMode::test_helper_mode_all 0.00
No log output captured.
Passed tests/test_utils/test_helper.py::TestHelperMode::test_screaming_snake_case 0.00
No log output captured.
Passed tests/test_utils/test_helper.py::TestHelperMode::test_lower_camel_case 0.00
No log output captured.
Passed tests/test_utils/test_helper.py::TestHelperMode::test_camel_case 0.00
No log output captured.
Passed tests/test_utils/test_helper.py::TestHelperMode::test_snake_case 0.00
No log output captured.
Passed tests/test_utils/test_helper.py::TestHelperMode::test_lowercase 0.00
No log output captured.
Passed tests/test_utils/test_helper.py::TestHelperMode::test_extended_converters 0.00
No log output captured.
Passed tests/test_utils/test_helper.py::TestOrderedHelper::test_items_are_ordered 0.00
No log output captured.
Passed tests/test_utils/test_helper.py::TestOrderedHelper::test_list_items_are_ordered 0.00
No log output captured.
Passed tests/test_utils/test_helper.py::TestDefaultDescriptor::test_descriptor_fs 0.00
No log output captured.
Passed tests/test_utils/test_helper.py::TestDefaultDescriptor::test_init 0.00
No log output captured.
Passed tests/test_utils/test_helper.py::TestDefaultDescriptor::test_nullability 0.00
No log output captured.
Passed tests/test_utils/test_imports.py::TestImports::test_bad_type 0.00
No log output captured.
Passed tests/test_utils/test_imports.py::TestImports::test_bad_format[module] 0.00
No log output captured.
Passed tests/test_utils/test_imports.py::TestImports::test_bad_format[module:] 0.00
No log output captured.
Passed tests/test_utils/test_imports.py::TestImports::test_bad_format[:attribute] 0.00
No log output captured.
Passed tests/test_utils/test_imports.py::TestImports::test_bad_value[module] 0.00
No log output captured.
Passed tests/test_utils/test_imports.py::TestImports::test_bad_value[aiogram.KABOOM] 0.00
No log output captured.
Passed tests/test_utils/test_imports.py::TestImports::test_bad_value[aiogram.KABOOM.TEST] 0.00
No log output captured.
Passed tests/test_utils/test_imports.py::TestImports::test_has_no_attribute 0.00
No log output captured.
Passed tests/test_utils/test_imports.py::TestImports::test_imported 0.00
No log output captured.
Passed tests/test_utils/test_markdown.py::TestMarkdown::test_formatter[text-args0- -test test] 0.00
No log output captured.
Passed tests/test_utils/test_markdown.py::TestMarkdown::test_formatter[text-args1- -test test] 0.00
No log output captured.
Passed tests/test_utils/test_markdown.py::TestMarkdown::test_formatter[text-args2-None-test test] 0.00
No log output captured.
Passed tests/test_utils/test_markdown.py::TestMarkdown::test_formatter[bold-args3- -*test test*] 0.00
No log output captured.
Passed tests/test_utils/test_markdown.py::TestMarkdown::test_formatter[hbold-args4- -<b>test test</b>] 0.00
No log output captured.
Passed tests/test_utils/test_markdown.py::TestMarkdown::test_formatter[italic-args5- -_test test_ ] 0.00
No log output captured.
Passed tests/test_utils/test_markdown.py::TestMarkdown::test_formatter[hitalic-args6- -<i>test test</i>] 0.00
No log output captured.
Passed tests/test_utils/test_markdown.py::TestMarkdown::test_formatter[code-args7- -`test test`] 0.00
No log output captured.
Passed tests/test_utils/test_markdown.py::TestMarkdown::test_formatter[hcode-args8- -<code>test test</code>] 0.00
No log output captured.
Passed tests/test_utils/test_markdown.py::TestMarkdown::test_formatter[pre-args9- -```test test```] 0.00
No log output captured.
Passed tests/test_utils/test_markdown.py::TestMarkdown::test_formatter[hpre-args10- -<pre>test test</pre>] 0.00
No log output captured.
Passed tests/test_utils/test_markdown.py::TestMarkdown::test_formatter[underline-args11- -__test test__] 0.00
No log output captured.
Passed tests/test_utils/test_markdown.py::TestMarkdown::test_formatter[hunderline-args12- -<u>test test</u>] 0.00
No log output captured.
Passed tests/test_utils/test_markdown.py::TestMarkdown::test_formatter[strikethrough-args13- -~test test~] 0.00
No log output captured.
Passed tests/test_utils/test_markdown.py::TestMarkdown::test_formatter[hstrikethrough-args14- -<s>test test</s>] 0.00
No log output captured.
Passed tests/test_utils/test_markdown.py::TestMarkdown::test_formatter[link-args15-None-[test](https://aiogram.dev)] 0.00
No log output captured.
Passed tests/test_utils/test_markdown.py::TestMarkdown::test_formatter[hlink-args16-None-<a href="https://aiogram.dev">test</a>] 0.00
No log output captured.
Passed tests/test_utils/test_markdown.py::TestMarkdown::test_formatter[hide_link-args17-None-<a href="https://aiogram.dev">&#8203;</a>] 0.00
No log output captured.
Passed tests/test_utils/test_mixins.py::TestDataMixin::test_store_value 0.00
No log output captured.
Passed tests/test_utils/test_mixins.py::TestDataMixin::test_remove_value 0.00
No log output captured.
Passed tests/test_utils/test_mixins.py::TestDataMixin::test_getter 0.00
No log output captured.
Passed tests/test_utils/test_mixins.py::TestContextInstanceMixin::test_empty 0.00
No log output captured.
Passed tests/test_utils/test_mixins.py::TestContextInstanceMixin::test_set_wrong_type 0.00
No log output captured.
Passed tests/test_utils/test_text_decorations.py::TestTextDecoration::test_apply_single_entity[decorator0-entity0-test] 0.00
No log output captured.
Passed tests/test_utils/test_text_decorations.py::TestTextDecoration::test_apply_single_entity[decorator1-entity1-<a href="https://aiogram.dev">test</a>] 0.00
No log output captured.
Passed tests/test_utils/test_text_decorations.py::TestTextDecoration::test_apply_single_entity[decorator2-entity2-<b>test</b>] 0.00
No log output captured.
Passed tests/test_utils/test_text_decorations.py::TestTextDecoration::test_apply_single_entity[decorator3-entity3-<i>test</i>] 0.00
No log output captured.
Passed tests/test_utils/test_text_decorations.py::TestTextDecoration::test_apply_single_entity[decorator4-entity4-<code>test</code>] 0.00
No log output captured.
Passed tests/test_utils/test_text_decorations.py::TestTextDecoration::test_apply_single_entity[decorator5-entity5-<pre>test</pre>] 0.00
No log output captured.
Passed tests/test_utils/test_text_decorations.py::TestTextDecoration::test_apply_single_entity[decorator6-entity6-<pre><code class="language-python">test</code></pre>] 0.00
No log output captured.
Passed tests/test_utils/test_text_decorations.py::TestTextDecoration::test_apply_single_entity[decorator7-entity7-<u>test</u>] 0.00
No log output captured.
Passed tests/test_utils/test_text_decorations.py::TestTextDecoration::test_apply_single_entity[decorator8-entity8-<s>test</s>] 0.00
No log output captured.
Passed tests/test_utils/test_text_decorations.py::TestTextDecoration::test_apply_single_entity[decorator9-entity9-test] 0.00
No log output captured.
Passed tests/test_utils/test_text_decorations.py::TestTextDecoration::test_apply_single_entity[decorator10-entity10-test] 0.00
No log output captured.
Passed tests/test_utils/test_text_decorations.py::TestTextDecoration::test_apply_single_entity[decorator11-entity11-test] 0.00
No log output captured.
Passed tests/test_utils/test_text_decorations.py::TestTextDecoration::test_apply_single_entity[decorator12-entity12-test] 0.00
No log output captured.
Passed tests/test_utils/test_text_decorations.py::TestTextDecoration::test_apply_single_entity[decorator13-entity13-test] 0.00
No log output captured.
Passed tests/test_utils/test_text_decorations.py::TestTextDecoration::test_apply_single_entity[decorator14-entity14-<a href="tg://user?id=42">test</a>] 0.00
No log output captured.
Passed tests/test_utils/test_text_decorations.py::TestTextDecoration::test_apply_single_entity[decorator15-entity15-test] 0.00
No log output captured.
Passed tests/test_utils/test_text_decorations.py::TestTextDecoration::test_apply_single_entity[decorator16-entity16-<a href="https://aiogram.dev">test</a>] 0.00
No log output captured.
Passed tests/test_utils/test_text_decorations.py::TestTextDecoration::test_apply_single_entity[decorator17-entity17-*test*] 0.00
No log output captured.
Passed tests/test_utils/test_text_decorations.py::TestTextDecoration::test_apply_single_entity[decorator18-entity18-_test_ ] 0.00
No log output captured.
Passed tests/test_utils/test_text_decorations.py::TestTextDecoration::test_apply_single_entity[decorator19-entity19-`test`] 0.00
No log output captured.
Passed tests/test_utils/test_text_decorations.py::TestTextDecoration::test_apply_single_entity[decorator20-entity20-```test```] 0.00
No log output captured.
Passed tests/test_utils/test_text_decorations.py::TestTextDecoration::test_apply_single_entity[decorator21-entity21-```python test ```] 0.00
No log output captured.
Passed tests/test_utils/test_text_decorations.py::TestTextDecoration::test_apply_single_entity[decorator22-entity22-__test__] 0.00
No log output captured.
Passed tests/test_utils/test_text_decorations.py::TestTextDecoration::test_apply_single_entity[decorator23-entity23-~test~] 0.00
No log output captured.
Passed tests/test_utils/test_text_decorations.py::TestTextDecoration::test_apply_single_entity[decorator24-entity24-test] 0.00
No log output captured.
Passed tests/test_utils/test_text_decorations.py::TestTextDecoration::test_apply_single_entity[decorator25-entity25-test] 0.00
No log output captured.
Passed tests/test_utils/test_text_decorations.py::TestTextDecoration::test_apply_single_entity[decorator26-entity26-test] 0.00
No log output captured.
Passed tests/test_utils/test_text_decorations.py::TestTextDecoration::test_apply_single_entity[decorator27-entity27-test] 0.00
No log output captured.
Passed tests/test_utils/test_text_decorations.py::TestTextDecoration::test_apply_single_entity[decorator28-entity28-test] 0.00
No log output captured.
Passed tests/test_utils/test_text_decorations.py::TestTextDecoration::test_apply_single_entity[decorator29-entity29-[test](tg://user?id=42)] 0.00
No log output captured.
Passed tests/test_utils/test_text_decorations.py::TestTextDecoration::test_quote[decorator0-test-test] 0.00
No log output captured.
Passed tests/test_utils/test_text_decorations.py::TestTextDecoration::test_quote[decorator1-test < test-test &lt; test] 0.00
No log output captured.
Passed tests/test_utils/test_text_decorations.py::TestTextDecoration::test_quote[decorator2-test > test-test &gt; test] 0.00
No log output captured.
Passed tests/test_utils/test_text_decorations.py::TestTextDecoration::test_quote[decorator3-test & test-test &amp; test] 0.00
No log output captured.
Passed tests/test_utils/test_text_decorations.py::TestTextDecoration::test_quote[decorator4-test @ test-test @ test] 0.00
No log output captured.
Passed tests/test_utils/test_text_decorations.py::TestTextDecoration::test_quote[decorator5-test-test] 0.00
No log output captured.
Passed tests/test_utils/test_text_decorations.py::TestTextDecoration::test_quote[decorator6-[test]-\[test\]] 0.00
No log output captured.
Passed tests/test_utils/test_text_decorations.py::TestTextDecoration::test_quote[decorator7-test ` test-test \` test] 0.00
No log output captured.
Passed tests/test_utils/test_text_decorations.py::TestTextDecoration::test_quote[decorator8-test * test-test \* test] 0.00
No log output captured.
Passed tests/test_utils/test_text_decorations.py::TestTextDecoration::test_quote[decorator9-test _ test-test \_ test] 0.00
No log output captured.
Passed tests/test_utils/test_text_decorations.py::TestTextDecoration::test_unparse[decorator0-test-None-test] 0.00
No log output captured.
Passed tests/test_utils/test_text_decorations.py::TestTextDecoration::test_unparse[decorator1-test-entities1-test] 0.00
No log output captured.
Passed tests/test_utils/test_text_decorations.py::TestTextDecoration::test_unparse[decorator2-test1 test2 test3 test4 test5 test6 test7-entities2-test1 <b>test2 <u>test3</u> test4 <i>test5</i> test6</b> test7] 0.00
No log output captured.
Passed tests/test_utils/test_text_decorations.py::TestTextDecoration::test_unparse[decorator3-test1 test2 test3 test4 test5-entities3-test1 <b>test2 <u>test3</u> test4</b> test5] 0.00
No log output captured.
Passed tests/test_utils/test_text_decorations.py::TestTextDecoration::test_unparse[decorator4-test1 test2 test3 test4-entities4-test1 <b>test2 <u>test3</u></b> test4] 0.00
No log output captured.
Passed tests/test_utils/test_text_decorations.py::TestTextDecoration::test_unparse[decorator5-test1 test2 test3-entities5-test1 <b>test2</b> test3] 0.00
No log output captured.
Passed tests/test_utils/test_text_decorations.py::TestTextDecoration::test_unparse[decorator6-test1 test2-entities6-<b>test1</b> test2] 0.00
No log output captured.
Passed tests/test_utils/test_text_decorations.py::TestTextDecoration::test_unparse[decorator7-strike bold-entities7-<s>strike</s> <b>bold</b>] 0.00
No log output captured.
Passed tests/test_utils/test_text_decorations.py::TestTextDecoration::test_unparse[decorator8-test-entities8-<s><b>test</b></s>] 0.00
No log output captured.
Passed tests/test_utils/test_text_decorations.py::TestTextDecoration::test_unparse[decorator9-strikeboldunder-entities9-<s>strike<b>bold<u>under</u></b></s>] 0.00
No log output captured.
Passed tests/test_utils/test_text_decorations.py::TestTextDecoration::test_unparse[decorator10-@username-entities10-<b>@username</b>] 0.00
No log output captured.
Passed tests/test_utils/test_text_decorations.py::TestTextDecoration::test_unparse[decorator11-/command-entities11-<b>/command</b>] 0.00
No log output captured.
Passed tests/test_utils/test_text_decorations.py::TestTextDecoration::test_unparse[decorator12-+1-212-555-0123-entities12-<b>+1-212-555-0123</b>] 0.00
No log output captured.
Passed tests/test_utils/test_text_decorations.py::TestTextDecoration::test_unparse[decorator13-test te๐Ÿ‘๐Ÿฟst test-entities13-test <b>te๐Ÿ‘๐Ÿฟst</b> test] 0.00
No log output captured.
Passed tests/test_utils/test_text_decorations.py::TestTextDecoration::test_unparse[decorator14-๐Ÿ‘‹๐Ÿพ Hi!-entities14-<b>๐Ÿ‘‹๐Ÿพ Hi!</b>] 0.00
No log output captured.
Passed tests/test_utils/test_token.py::TestCheckToken::test_valid 0.00
No log output captured.
Passed tests/test_utils/test_token.py::TestCheckToken::test_invalid_token[123456789:AABBCCDDEEFFaabbccddeeff 123456789] 0.00
No log output captured.
Passed tests/test_utils/test_token.py::TestCheckToken::test_invalid_token[ABC:AABBCCDDEEFFaabbccddeeff123456789] 0.00
No log output captured.
Passed tests/test_utils/test_token.py::TestCheckToken::test_invalid_token[:AABBCCDDEEFFaabbccddeeff123456789] 0.00
No log output captured.
Passed tests/test_utils/test_token.py::TestCheckToken::test_invalid_token[123456789:] 0.00
No log output captured.
Passed tests/test_utils/test_token.py::TestCheckToken::test_invalid_token[ABC AABBCCDDEEFFaabbccddeeff123456789] 0.00
No log output captured.
Passed tests/test_utils/test_token.py::TestCheckToken::test_invalid_token[None] 0.00
No log output captured.
Passed tests/test_utils/test_token.py::TestCheckToken::test_invalid_token[12345678] 0.00
No log output captured.
Passed tests/test_utils/test_token.py::TestCheckToken::test_invalid_token[invalid_token7] 0.00
No log output captured.
Passed tests/test_utils/test_token.py::TestExtractBotId::test_extract_bot_id 0.00
No log output captured.